*Heading
** Job name: Job-1 Model name: Model-1
*Preprint, echo=NO, model=NO, history=NO, contact=NO
**
** PARTS
**
*Part, name=Truss_inter
*Node
*Element, type=T3D2
*Nset, nset=PROPERTY_SET, generate
*Elset, elset=PROPERTY_SET, generate
** Section: Truss_section
*Solid Section, elset=PROPERTY_SET, material=Steel
4e-05,
*End Part
**
**
** ASSEMBLY
**
*Assembly, name=Assembly
**
*Instance, name=Truss_inter-1, part=Truss_inter
*End Instance
**
*Nset, nset=BOUND_SET, instance=Truss_inter-1
*Nset, nset=LOAD_SET, instance=Truss_inter-1
*End Assembly
**
** MATERIALS
**
*Material, name=Steel
*Elastic
 2e+11, 0.33
**
** BOUNDARY CONDITIONS
**
** Name: BOUND Type: Symmetry/Antisymmetry/Encastre
*Boundary
BOUND_SET, ENCASTRE
** ----------------------------------------------------------------
**
** STEP: Step_1
**
*Step, name=Step_1, nlgeom=NO
*Static
1., 1., 1e-05, 1.
**
** LOADS
**
** Name: LOAD   Type: Concentrated force
*Cload
LOAD_SET, 2, -1000.
**
** OUTPUT REQUESTS
**
*Restart, write, frequency=0
**
** FIELD OUTPUT: F-Output-1
**
*Output, field, variable=PRESELECT
**
** HISTORY OUTPUT: H-Output-1
**
*Output, history, variable=PRESELECT
*End Step